master2.0 branch Use mvn compiler does not pass

#mvn package -DskipTests

……

Downloaded: https://repo.maven.apache.org/maven2/org/elasticsearch/elasticsearch/1.5.2/elasticsearch-1.5.2.jar (13452 KB at 97.8 KB/sec)

Downloaded: https://repo.maven.apache.org/maven2/org/apache/directory/server/apacheds-all/2.0.0-M17/apacheds-all-2.0.0-M17.jar (10398 KB at 41.4 KB/sec)

Downloading: https://oss.sonatype.org/content/repositories/releases/org/apache/lucene/lucene-codecs/4.10.4/lucene-codecs-4.10.4.jar

[INFO] ------------------------------------------------------------------------

[INFO] BUILD FAILURE

[INFO] ------------------------------------------------------------------------

[INFO] Total time: 06:51 min

[INFO] Finished at: 2015-08-31T11:47:22+08:00

[INFO] Final Memory: 15M/568M

[INFO] ------------------------------------------------------------------------

[ERROR] Failed to execute goal on project search-guard: Could not resolve dependencies for project com.floragunn:search-guard:jar:0.6-SNAPSHOT: The following artifacts could not be resolved: com.google.guava:guava:jar:18.0, org.apache.lucene:lucene-codecs:jar:4.10.4: Could not transfer artifact com.google.guava:guava:jar:18.0 from/to central (https://repo.maven.apache.org/maven2): GET request of: com/google/guava/guava/18.0/guava-18.0.jar from central failed: Connection reset -> [Help 1]

[ERROR]

[ERROR] To see the full stack trace of the errors, re-run Maven with the -e switch.

[ERROR] Re-run Maven using the -X switch to enable full debug logging.

[ERROR]

[ERROR] For more information about the errors and possible solutions, please read the following articles:

[ERROR] [Help 1] http://cwiki.apache.org/confluence/display/MAVEN/DependencyResolutionException

from the readme

"Development branch for SG and upcoming ES 2.0. This is currently highly unstable and may not even compile."

···

Am 31.08.2015 um 05:53 schrieb elain ding <elain2013@gmail.com>:

#mvn package -DskipTests
……
Downloaded: https://repo.maven.apache.org/maven2/org/elasticsearch/elasticsearch/1.5.2/elasticsearch-1.5.2.jar (13452 KB at 97.8 KB/sec)
Downloaded: https://repo.maven.apache.org/maven2/org/apache/directory/server/apacheds-all/2.0.0-M17/apacheds-all-2.0.0-M17.jar (10398 KB at 41.4 KB/sec)
Downloading: https://oss.sonatype.org/content/repositories/releases/org/apache/lucene/lucene-codecs/4.10.4/lucene-codecs-4.10.4.jar
[INFO] ------------------------------------------------------------------------
[INFO] BUILD FAILURE
[INFO] ------------------------------------------------------------------------
[INFO] Total time: 06:51 min
[INFO] Finished at: 2015-08-31T11:47:22+08:00
[INFO] Final Memory: 15M/568M
[INFO] ------------------------------------------------------------------------
[ERROR] Failed to execute goal on project search-guard: Could not resolve dependencies for project com.floragunn:search-guard:jar:0.6-SNAPSHOT: The following artifacts could not be resolved: com.google.guava:guava:jar:18.0, org.apache.lucene:lucene-codecs:jar:4.10.4: Could not transfer artifact com.google.guava:guava:jar:18.0 from/to central (https://repo.maven.apache.org/maven2): GET request of: com/google/guava/guava/18.0/guava-18.0.jar from central failed: Connection reset -> [Help 1]
[ERROR]
[ERROR] To see the full stack trace of the errors, re-run Maven with the -e switch.
[ERROR] Re-run Maven using the -X switch to enable full debug logging.
[ERROR]
[ERROR] For more information about the errors and possible solutions, please read the following articles:
[ERROR] [Help 1] http://cwiki.apache.org/confluence/display/MAVEN/DependencyResolutionException

--
You received this message because you are subscribed to the Google Groups "Search Guard" group.
To unsubscribe from this group and stop receiving emails from it, send an email to search-guard+unsubscribe@googlegroups.com.
To post to this group, send email to search-guard@googlegroups.com.
To view this discussion on the web visit https://groups.google.com/d/msgid/search-guard/f1dc5b2b-4959-45c2-94f5-fb0278677e56%40googlegroups.com.
For more options, visit https://groups.google.com/d/optout.

first alpha version for elasticsearch 2 now available https://github.com/floragunncom/search-guard/tree/master2.1

···

Am Montag, 31. August 2015 05:53:12 UTC+2 schrieb elain ding:

#mvn package -DskipTests

……

Downloaded: https://repo.maven.apache.org/maven2/org/elasticsearch/elasticsearch/1.5.2/elasticsearch-1.5.2.jar (13452 KB at 97.8 KB/sec)

Downloaded: https://repo.maven.apache.org/maven2/org/apache/directory/server/apacheds-all/2.0.0-M17/apacheds-all-2.0.0-M17.jar (10398 KB at 41.4 KB/sec)

Downloading: https://oss.sonatype.org/content/repositories/releases/org/apache/lucene/lucene-codecs/4.10.4/lucene-codecs-4.10.4.jar

[INFO] ------------------------------------------------------------------------

[INFO] BUILD FAILURE

[INFO] ------------------------------------------------------------------------

[INFO] Total time: 06:51 min

[INFO] Finished at: 2015-08-31T11:47:22+08:00

[INFO] Final Memory: 15M/568M

[INFO] ------------------------------------------------------------------------

[ERROR] Failed to execute goal on project search-guard: Could not resolve dependencies for project com.floragunn:search-guard:jar:0.6-SNAPSHOT: The following artifacts could not be resolved: com.google.guava:guava:jar:18.0, org.apache.lucene:lucene-codecs:jar:4.10.4: Could not transfer artifact com.google.guava:guava:jar:18.0 from/to central (https://repo.maven.apache.org/maven2): GET request of: com/google/guava/guava/18.0/guava-18.0.jar from central failed: Connection reset -> [Help 1]

[ERROR]

[ERROR] To see the full stack trace of the errors, re-run Maven with the -e switch.

[ERROR] Re-run Maven using the -X switch to enable full debug logging.

[ERROR]

[ERROR] For more information about the errors and possible solutions, please read the following articles:

[ERROR] [Help 1] http://cwiki.apache.org/confluence/display/MAVEN/DependencyResolutionException